Information card for entry 7709494
Formula | C27 H38 Br4 N2 Se |
Calculated formula | C27 H38 Br4 N2 Se |
SMILES | Br[Se+]=C1N(CCN1c1c(cccc1C(C)C)C(C)C)c1c(cccc1C(C)C)C(C)C.Br[Br-]Br |
Title of publication | Reactions of N-heterocyclic carbene-based chalcogenoureas with halogens: a diverse range of outcomes |
Authors of publication | Saab, Marina; Nelson, David J.; Leech, Matthew C.; Lam, Kevin; Nolan, Steven P.; Nahra, Fady; Van Hecke, Kristof |
Journal of publication | Dalton Transactions |
Year of publication | 2022 |
a | 9.7248 ± 0.0001 Å |
b | 18.3045 ± 0.0002 Å |
c | 17.8287 ± 0.0003 Å |
α | 90° |
β | 98.166 ± 0.001° |
γ | 90° |
Cell volume | 3141.47 ± 0.07 Å3 |
Cell temperature | 100 ± 0.1 K |
Ambient diffraction temperature | 100 ± 0.1 K |
Number of distinct elements | 5 |
Space group number | 14 |
Hermann-Mauguin space group symbol | P 1 21/n 1 |
Hall space group symbol | -P 2yn |
Residual factor for all reflections | 0.0428 |
Residual factor for significantly intense reflections | 0.029 |
Weighted residual factors for significantly intense reflections | 0.0567 |
Weighted residual factors for all reflections included in the refinement | 0.0617 |
Goodness-of-fit parameter for all reflections included in the refinement | 1.067 |
Diffraction radiation probe | x-ray |
Diffraction radiation wavelength | 1.54184 Å |
Diffraction radiation type | CuKα |