Information card for entry 7709498
Formula | C30 H42 Br2 Cl2 N2 Se |
Calculated formula | C30 H42 Br2 Cl2 N2 Se |
SMILES | Br[Se](Br)=C1N(C(=C(N1c1c(cccc1C(C)C)C(C)C)C)C)c1c(cccc1C(C)C)C(C)C.ClCCl |
Title of publication | Reactions of N-heterocyclic carbene-based chalcogenoureas with halogens: a diverse range of outcomes |
Authors of publication | Saab, Marina; Nelson, David J.; Leech, Matthew C.; Lam, Kevin; Nolan, Steven P.; Nahra, Fady; Van Hecke, Kristof |
Journal of publication | Dalton Transactions |
Year of publication | 2022 |
a | 9.7087 ± 0.0003 Å |
b | 12.5412 ± 0.0003 Å |
c | 15.164 ± 0.0003 Å |
α | 77.201 ± 0.002° |
β | 77.009 ± 0.002° |
γ | 73.293 ± 0.002° |
Cell volume | 1698.62 ± 0.08 Å3 |
Cell temperature | 100 ± 0.1 K |
Ambient diffraction temperature | 100 ± 0.1 K |
Number of distinct elements | 6 |
Space group number | 2 |
Hermann-Mauguin space group symbol | P -1 |
Hall space group symbol | -P 1 |
Residual factor for all reflections | 0.0344 |
Residual factor for significantly intense reflections | 0.0288 |
Weighted residual factors for significantly intense reflections | 0.0678 |
Weighted residual factors for all reflections included in the refinement | 0.0706 |
Goodness-of-fit parameter for all reflections included in the refinement | 1.044 |
Diffraction radiation probe | x-ray |
Diffraction radiation wavelength | 1.54184 Å |
Diffraction radiation type | CuKα |