Information card for entry 7709503
Formula | C21 H24 Br2 N2 S |
Calculated formula | C21 H24 Br2 N2 S |
SMILES | [Br](Br)[S]=C1N(C=CN1c1c(cc(cc1C)C)C)c1c(cc(cc1C)C)C |
Title of publication | Reactions of N-heterocyclic carbene-based chalcogenoureas with halogens: a diverse range of outcomes |
Authors of publication | Saab, Marina; Nelson, David J.; Leech, Matthew C.; Lam, Kevin; Nolan, Steven P.; Nahra, Fady; Van Hecke, Kristof |
Journal of publication | Dalton Transactions |
Year of publication | 2022 |
a | 10.3863 ± 0.0002 Å |
b | 15.2158 ± 0.0002 Å |
c | 14.1625 ± 0.0003 Å |
α | 90° |
β | 105.698 ± 0.002° |
γ | 90° |
Cell volume | 2154.7 ± 0.07 Å3 |
Cell temperature | 100 ± 0.1 K |
Ambient diffraction temperature | 100 ± 0.1 K |
Number of distinct elements | 5 |
Space group number | 14 |
Hermann-Mauguin space group symbol | P 1 21/c 1 |
Hall space group symbol | -P 2ybc |
Residual factor for all reflections | 0.0322 |
Residual factor for significantly intense reflections | 0.0269 |
Weighted residual factors for significantly intense reflections | 0.0653 |
Weighted residual factors for all reflections included in the refinement | 0.0679 |
Goodness-of-fit parameter for all reflections included in the refinement | 1.08 |
Diffraction radiation probe | x-ray |
Diffraction radiation wavelength | 1.54184 Å |
Diffraction radiation type | CuKα |