Information card for entry 7709509
Formula | C21 H26 Cl2 N2 Se |
Calculated formula | C21 H26 Cl2 N2 Se |
SMILES | [Se](Cl)(Cl)=C1N(CCN1c1c(cc(cc1C)C)C)c1c(cc(cc1C)C)C |
Title of publication | Reactions of N-heterocyclic carbene-based chalcogenoureas with halogens: a diverse range of outcomes |
Authors of publication | Saab, Marina; Nelson, David J.; Leech, Matthew C.; Lam, Kevin; Nolan, Steven P.; Nahra, Fady; Van Hecke, Kristof |
Journal of publication | Dalton Transactions |
Year of publication | 2022 |
a | 7.3535 ± 0.0002 Å |
b | 15.3563 ± 0.0004 Å |
c | 18.1591 ± 0.0004 Å |
α | 90° |
β | 92.485 ± 0.002° |
γ | 90° |
Cell volume | 2048.64 ± 0.09 Å3 |
Cell temperature | 100 ± 0.1 K |
Ambient diffraction temperature | 100 ± 0.1 K |
Number of distinct elements | 5 |
Space group number | 14 |
Hermann-Mauguin space group symbol | P 1 21/n 1 |
Hall space group symbol | -P 2yn |
Residual factor for all reflections | 0.0631 |
Residual factor for significantly intense reflections | 0.0471 |
Weighted residual factors for significantly intense reflections | 0.1113 |
Weighted residual factors for all reflections included in the refinement | 0.1187 |
Goodness-of-fit parameter for all reflections included in the refinement | 1.109 |
Diffraction radiation probe | x-ray |
Diffraction radiation wavelength | 1.54184 Å |
Diffraction radiation type | CuKα |