Information card for entry 7709512
Formula | C21 H24 I2 N2 S |
Calculated formula | C21 H24 I2 N2 S |
SMILES | [I](I)[S]=C1N(C=CN1c1c(cc(cc1C)C)C)c1c(cc(cc1C)C)C |
Title of publication | Reactions of N-heterocyclic carbene-based chalcogenoureas with halogens: a diverse range of outcomes |
Authors of publication | Saab, Marina; Nelson, David J.; Leech, Matthew C.; Lam, Kevin; Nolan, Steven P.; Nahra, Fady; Van Hecke, Kristof |
Journal of publication | Dalton Transactions |
Year of publication | 2022 |
a | 12.55015 ± 0.00017 Å |
b | 11.35537 ± 0.00012 Å |
c | 15.8885 ± 0.0002 Å |
α | 90° |
β | 96.6229 ± 0.0011° |
γ | 90° |
Cell volume | 2249.19 ± 0.05 Å3 |
Cell temperature | 100 ± 0.1 K |
Ambient diffraction temperature | 100 ± 0.1 K |
Number of distinct elements | 5 |
Space group number | 14 |
Hermann-Mauguin space group symbol | P 1 21/c 1 |
Hall space group symbol | -P 2ybc |
Residual factor for all reflections | 0.0313 |
Residual factor for significantly intense reflections | 0.0234 |
Weighted residual factors for significantly intense reflections | 0.0487 |
Weighted residual factors for all reflections included in the refinement | 0.0518 |
Goodness-of-fit parameter for all reflections included in the refinement | 1.002 |
Diffraction radiation probe | x-ray |
Diffraction radiation wavelength | 1.54184 Å |
Diffraction radiation type | CuKα |