Information card for entry 7709544
Formula | C97 H68 Br8 Cl8 Co4 N24 O9 |
Calculated formula | C97 H68 Br8 Cl8 Co4 N24 O9 |
Title of publication | Discovery of thirteen cobalt (II) and copper (II) salicylaldehyde Schiff base complexes that induce apoptosis and autophagy in human lung adenocarcinoma A549/DDP cells and that can overcome cisplatin resistance in vitro and in vivo |
Authors of publication | Chen, Yating; Zhang, Shaonan; Wang, Zhen-Feng; Wei, Qingmin; Zhang, Shuhua |
Journal of publication | Dalton Transactions |
Year of publication | 2022 |
a | 10.2469 ± 0.0005 Å |
b | 13.4344 ± 0.0006 Å |
c | 20.9301 ± 0.0009 Å |
α | 88.404 ± 0.004° |
β | 80.376 ± 0.004° |
γ | 79.353 ± 0.004° |
Cell volume | 2791.8 ± 0.2 Å3 |
Cell temperature | 298 ± 2 K |
Ambient diffraction temperature | 298 ± 2 K |
Number of distinct elements | 7 |
Space group number | 2 |
Hermann-Mauguin space group symbol | P -1 |
Hall space group symbol | -P 1 |
Residual factor for all reflections | 0.0632 |
Residual factor for significantly intense reflections | 0.0426 |
Weighted residual factors for significantly intense reflections | 0.1047 |
Weighted residual factors for all reflections included in the refinement | 0.1179 |
Goodness-of-fit parameter for all reflections included in the refinement | 0.995 |
Diffraction radiation wavelength | 0.71073 Å |
Diffraction radiation type | MoKα |