Information card for entry 7709597
Formula | C50 H50 K N6 O8 S2 Yb |
Calculated formula | C50 H50 K N6 O8 S2 Yb |
Title of publication | Record efficiency of 1000 nm electroluminescence from a solution-processable host-free OLED |
Authors of publication | Kovalenko, Anton; Tcelykh, Lyubov O.; Koshelev, Daniil; Vashchenko, Andrey A.; Tsymbarenko, Dmitry M.; Goloveshkin, Alexander S.; Aleksandrov, Aleksey; Burlov, Anatolii; Utochnikova, Valentina V. |
Journal of publication | Dalton Transactions |
Year of publication | 2022 |
a | 15.388 ± 0.0007 Å |
b | 17.1596 ± 0.0008 Å |
c | 18.1761 ± 0.0009 Å |
α | 90° |
β | 94.562 ± 0.002° |
γ | 90° |
Cell volume | 4784.2 ± 0.4 Å3 |
Cell temperature | 120 K |
Ambient diffraction temperature | 120 K |
Number of distinct elements | 7 |
Space group number | 14 |
Hermann-Mauguin space group symbol | P 1 21/n 1 |
Hall space group symbol | -P 2yn |
Residual factor for all reflections | 0.1136 |
Residual factor for significantly intense reflections | 0.0461 |
Weighted residual factors for significantly intense reflections | 0.0903 |
Weighted residual factors for all reflections included in the refinement | 0.1126 |
Goodness-of-fit parameter for all reflections included in the refinement | 1.009 |
Diffraction radiation wavelength | 0.71073 Å |
Diffraction radiation type | MoKα |