Information card for entry 7709610
Chemical name | Ga(N(C6F5)2)3 x CNtBu |
Formula | C41 H9 F30 Ga N4 |
Calculated formula | C41 H9 F30 Ga N4 |
Title of publication | Lewis Acid-Base Adducts of Al(N(C6F5)2)3 and Ga(N(C6F5)2)3 – Structural Features and Adduct Formation Enthalpies |
Authors of publication | Kögel, Julius F; Sorokin, Denis A.; Scott, Martin; Harms, Klaus; Himmel, Daniel; Krossing, Ingo; Sundermeyer, Jörg |
Journal of publication | Dalton Transactions |
Year of publication | 2022 |
a | 11.0023 ± 0.0004 Å |
b | 11.1257 ± 0.0005 Å |
c | 19.8025 ± 0.0008 Å |
α | 76.581 ± 0.003° |
β | 83.893 ± 0.003° |
γ | 61.802 ± 0.003° |
Cell volume | 2077.97 ± 0.16 Å3 |
Cell temperature | 100 ± 2 K |
Ambient diffraction temperature | 100 ± 2 K |
Number of distinct elements | 5 |
Space group number | 2 |
Hermann-Mauguin space group symbol | P -1 |
Hall space group symbol | -P 1 |
Residual factor for all reflections | 0.0565 |
Residual factor for significantly intense reflections | 0.0323 |
Weighted residual factors for significantly intense reflections | 0.0571 |
Weighted residual factors for all reflections included in the refinement | 0.061 |
Goodness-of-fit parameter for all reflections included in the refinement | 0.86 |
Diffraction radiation wavelength | 0.71073 Å |
Diffraction radiation type | MoKα |