Information card for entry 7709634
Formula |
C30 H20 Mn N2 O6 |
Calculated formula |
C30 H20 Mn N2 O6 |
Title of publication |
Structure, magnetic properties and spin density of two alternative Mn(II) coordination polymers based on 1,4-bis(2'-carboxyphenoxy)benzene |
Authors of publication |
Wang, Ai; Yang, Bin; Wang, Yan; Hu, Zijia; Wei, Zhihong; Zhu, Miaoli; Englert, Ulli |
Journal of publication |
Dalton Transactions |
Year of publication |
2022 |
a |
9.9216 ± 0.0007 Å |
b |
10.1928 ± 0.0007 Å |
c |
13.1745 ± 0.0009 Å |
α |
75.27 ± 0.002° |
β |
79.492 ± 0.002° |
γ |
75.665 ± 0.002° |
Cell volume |
1238.24 ± 0.15 Å3 |
Cell temperature |
296 ± 2 K |
Ambient diffraction temperature |
296 ± 2 K |
Number of distinct elements |
5 |
Space group number |
2 |
Hermann-Mauguin space group symbol |
P -1 |
Hall space group symbol |
-P 1 |
Residual factor for all reflections |
0.09 |
Residual factor for significantly intense reflections |
0.0478 |
Weighted residual factors for significantly intense reflections |
0.0986 |
Weighted residual factors for all reflections included in the refinement |
0.1124 |
Goodness-of-fit parameter for all reflections included in the refinement |
1.002 |
Diffraction radiation wavelength |
0.71073 Å |
Yes |
No |
No |