Information card for entry 7709649
Formula | C39 H36 Cl3 Dy O3 P3 |
Calculated formula | C39 H36 Cl3 Dy O3 P3 |
Title of publication | Stereoisomeric coordination polymers based on facial and meridional six-coordinate dysprosium(III) |
Authors of publication | Lin, Wei-Quan; Wang, Dan-Ru; Long, Wei-Jian; Lin, Li-Shan; Tao, Ze-Xian; Liu, Jun-Liang; Liu, Zhao-Qing; Leng, Ji-Dong |
Journal of publication | Dalton Transactions |
Year of publication | 2022 |
a | 11.9254 ± 0.0001 Å |
b | 12.0637 ± 0.0001 Å |
c | 15.1295 ± 0.0001 Å |
α | 96.832 ± 0.001° |
β | 98.582 ± 0.001° |
γ | 115.438 ± 0.001° |
Cell volume | 1902.29 ± 0.03 Å3 |
Cell temperature | 100 ± 0.1 K |
Ambient diffraction temperature | 100 ± 0.02 K |
Number of distinct elements | 6 |
Space group number | 2 |
Hermann-Mauguin space group symbol | P -1 |
Hall space group symbol | -P 1 |
Residual factor for all reflections | 0.0339 |
Residual factor for significantly intense reflections | 0.0313 |
Weighted residual factors for significantly intense reflections | 0.0843 |
Weighted residual factors for all reflections included in the refinement | 0.0865 |
Goodness-of-fit parameter for all reflections included in the refinement | 1.061 |
Diffraction radiation probe | x-ray |
Diffraction radiation wavelength | 1.54184 Å |
Diffraction radiation type | CuKα |