Information card for entry 7709670
Formula | C26 H19 Cl4 N4 P Pt |
Calculated formula | C26 H19 Cl4 N4 P Pt |
SMILES | [Pt]12(c3n(c4c([P]1(c1ccccc1)c1ccccc1)cccc4)nnc3c1[n]2cccc1)Cl.ClC(Cl)Cl |
Title of publication | 1,2,3-Triazole based ligands with phosphine and pyridine functionalities: Synthesis, PdII, PtII chemistry and catalytic studies |
Authors of publication | Radhakrishna, Latchupatula; Kote, Basvaraj S.; Kunchur, Harish S.; Pandey, Madhusudan Kumar; Mondal, Dipanjan; Balakrishna, Maravanji Shivaramaiah |
Journal of publication | Dalton Transactions |
Year of publication | 2022 |
a | 16.166 ± 0.002 Å |
b | 8.8783 ± 0.0012 Å |
c | 18.6934 ± 0.0013 Å |
α | 90° |
β | 103.613 ± 0.01° |
γ | 90° |
Cell volume | 2607.6 ± 0.5 Å3 |
Cell temperature | 150 K |
Ambient diffraction temperature | 150 K |
Number of distinct elements | 6 |
Space group number | 14 |
Hermann-Mauguin space group symbol | P 1 21/c 1 |
Hall space group symbol | -P 2ybc |
Residual factor for all reflections | 0.0779 |
Residual factor for significantly intense reflections | 0.0552 |
Weighted residual factors for significantly intense reflections | 0.1303 |
Weighted residual factors for all reflections included in the refinement | 0.1383 |
Goodness-of-fit parameter for all reflections included in the refinement | 1.036 |
Diffraction radiation probe | x-ray |
Diffraction radiation wavelength | 0.71073 Å |
Diffraction radiation type | MoKα |