Information card for entry 7709674
Formula | C38 H30 Cl4 N4 P2 Pd |
Calculated formula | C38 H30 Cl4 N4 P2 Pd |
Title of publication | 1,2,3-Triazole based ligands with phosphine and pyridine functionalities: Synthesis, PdII, PtII chemistry and catalytic studies |
Authors of publication | Radhakrishna, Latchupatula; Kote, Basvaraj S.; Kunchur, Harish S.; Pandey, Madhusudan Kumar; Mondal, Dipanjan; Balakrishna, Maravanji Shivaramaiah |
Journal of publication | Dalton Transactions |
Year of publication | 2022 |
a | 10.9552 ± 0.0003 Å |
b | 19.8167 ± 0.0005 Å |
c | 17.0756 ± 0.0006 Å |
α | 90° |
β | 100.667 ± 0.003° |
γ | 90° |
Cell volume | 3642.98 ± 0.19 Å3 |
Cell temperature | 100 K |
Ambient diffraction temperature | 100 K |
Number of distinct elements | 6 |
Space group number | 14 |
Hermann-Mauguin space group symbol | P 1 21/c 1 |
Hall space group symbol | -P 2ybc |
Residual factor for all reflections | 0.096 |
Residual factor for significantly intense reflections | 0.0614 |
Weighted residual factors for significantly intense reflections | 0.144 |
Weighted residual factors for all reflections included in the refinement | 0.1724 |
Goodness-of-fit parameter for all reflections included in the refinement | 1.06 |
Diffraction radiation probe | x-ray |
Diffraction radiation wavelength | 0.71073 Å |
Diffraction radiation type | MoKα |