Information card for entry 7709710
Formula | C66 H65 B Fe N14 O6 Zr |
Calculated formula | C66 H65 B Fe N14 O6 Zr |
Title of publication | Hybrid Iron(II) Phthalocyaninoclathrochelates with Terminal Reactive Vinyl Group and their Organo-Inorganic Polymeric Derivatives: Synthetic Approaches, X-ray Structures and Copolymerization with Styrene |
Authors of publication | Dudkin, Semyon V.; Chuprin, Alexander S.; Belova, Svetlana; Vologzhanina, Anna V. V.; Zubavichus, Yan V.; Kaletina, Polina M.; Shundrina, Inna; Bagryanskaya, Elena; Voloshin, Yan Z. |
Journal of publication | Dalton Transactions |
Year of publication | 2022 |
a | 12.904 ± 0.003 Å |
b | 13.289 ± 0.003 Å |
c | 17.715 ± 0.004 Å |
α | 92.23 ± 0.03° |
β | 97.04 ± 0.03° |
γ | 94.21 ± 0.03° |
Cell volume | 3003.2 ± 1.2 Å3 |
Cell temperature | 100 K |
Ambient diffraction temperature | 100 K |
Number of distinct elements | 7 |
Space group number | 2 |
Hermann-Mauguin space group symbol | P -1 |
Hall space group symbol | -P 1 |
Residual factor for all reflections | 0.0754 |
Residual factor for significantly intense reflections | 0.0644 |
Weighted residual factors for significantly intense reflections | 0.1608 |
Weighted residual factors for all reflections included in the refinement | 0.1709 |
Goodness-of-fit parameter for all reflections included in the refinement | 0.887 |
Diffraction radiation wavelength | 0.80246 Å |
Diffraction radiation type | synchrotron |