Information card for entry 7709728
Formula | C69.09 H72.37 B2 Fe4 N26 O3.09 P2 S2 |
Calculated formula | C69.1 H72.4 B2 Fe4 N26 O3.1 P2 S2 |
Title of publication | Manipulating the spin crossover behaviour in a series of cyanide-bridged {FeIII2FeII2} molecular squares through NCE- co-ligands |
Authors of publication | You, Maolin; Nguyen, Giang Truong; Shao, Dong; Wang, Te; Chang, Xiaoyong; Ungur, Liviu; Zhang, Yuan-Zhu |
Journal of publication | Dalton Transactions |
Year of publication | 2022 |
a | 29.674 ± 0.005 Å |
b | 47.644 ± 0.009 Å |
c | 13.108 ± 0.003 Å |
α | 90° |
β | 90° |
γ | 90° |
Cell volume | 18532 ± 6 Å3 |
Cell temperature | 300.01 K |
Ambient diffraction temperature | 300.01 K |
Number of distinct elements | 8 |
Space group number | 43 |
Hermann-Mauguin space group symbol | F d d 2 |
Hall space group symbol | F 2 -2d |
Residual factor for all reflections | 0.0443 |
Residual factor for significantly intense reflections | 0.0397 |
Weighted residual factors for significantly intense reflections | 0.1112 |
Weighted residual factors for all reflections included in the refinement | 0.1163 |
Goodness-of-fit parameter for all reflections included in the refinement | 1.057 |
Diffraction radiation probe | x-ray |
Diffraction radiation wavelength | 0.71073 Å |
Diffraction radiation type | MoKα |