Information card for entry 7709732
Formula | C46 H46 N16 Ni2 S4 |
Calculated formula | C46 H46 N16 Ni2 S4 |
Title of publication | Diastereomeric dinickel(ii) complexes with non-innocent bis(octaazamacrocyclic) ligands: isomerization, spectroelectrochemistry, DFT calculations and use in catalytic oxidation of cyclohexane |
Authors of publication | Dobrov, Anatolie; Darvasiová, Denisa; Zalibera, Michal; Bučinský, Lukáš; Jelemenská, Ingrid; Rapta, Peter; Shova, Sergiu; Dumitrescu, Dan G.; Andrade, Marta A.; Martins, Luísa M. D. R. S.; Pombeiro, Armando J. L.; Arion, Vladimir B. |
Journal of publication | Dalton Transactions |
Year of publication | 2022 |
a | 10.6789 ± 0.0007 Å |
b | 18.7474 ± 0.0012 Å |
c | 11.7267 ± 0.0007 Å |
α | 90° |
β | 91.771 ± 0.003° |
γ | 90° |
Cell volume | 2346.6 ± 0.3 Å3 |
Cell temperature | 100 ± 2 K |
Ambient diffraction temperature | 100 ± 2 K |
Number of distinct elements | 5 |
Space group number | 14 |
Hermann-Mauguin space group symbol | P 1 21/n 1 |
Hall space group symbol | -P 2yn |
Residual factor for all reflections | 0.1056 |
Residual factor for significantly intense reflections | 0.0766 |
Weighted residual factors for significantly intense reflections | 0.166 |
Weighted residual factors for all reflections included in the refinement | 0.1803 |
Goodness-of-fit parameter for all reflections included in the refinement | 1.115 |
Diffraction radiation wavelength | 0.71073 Å |
Diffraction radiation type | MoKα |