Information card for entry 7709734
Formula | C54 H48 N18 Ni2 S4 |
Calculated formula | C54 H48 N18 Ni2 S4 |
Title of publication | Diastereomeric dinickel(ii) complexes with non-innocent bis(octaazamacrocyclic) ligands: isomerization, spectroelectrochemistry, DFT calculations and use in catalytic oxidation of cyclohexane |
Authors of publication | Dobrov, Anatolie; Darvasiová, Denisa; Zalibera, Michal; Bučinský, Lukáš; Jelemenská, Ingrid; Rapta, Peter; Shova, Sergiu; Dumitrescu, Dan G.; Andrade, Marta A.; Martins, Luísa M. D. R. S.; Pombeiro, Armando J. L.; Arion, Vladimir B. |
Journal of publication | Dalton Transactions |
Year of publication | 2022 |
a | 34.235 ± 0.005 Å |
b | 34.235 ± 0.005 Å |
c | 20.889 ± 0.004 Å |
α | 90° |
β | 90° |
γ | 90° |
Cell volume | 24483 ± 7 Å3 |
Cell temperature | 100 ± 2 K |
Ambient diffraction temperature | 100 ± 2 K |
Number of distinct elements | 5 |
Space group number | 88 |
Hermann-Mauguin space group symbol | I 41/a :2 |
Hall space group symbol | -I 4ad |
Residual factor for all reflections | 0.0643 |
Residual factor for significantly intense reflections | 0.0543 |
Weighted residual factors for significantly intense reflections | 0.1631 |
Weighted residual factors for all reflections included in the refinement | 0.1736 |
Goodness-of-fit parameter for all reflections included in the refinement | 1.032 |
Diffraction radiation wavelength | 0.7 Å |
Diffraction radiation type | MoKα |