Information card for entry 7709755
Formula |
C30 H18 Ag2 Au2 N10 |
Calculated formula |
C30 H18 Ag2 Au2 N10 |
Title of publication |
Metallophilic interactions in silver(I) dicyanoaurate complexes |
Authors of publication |
Priola, Emanuele; Giordana, Alessia; Gomila, Rosa Maria; Zangrando, Ennio; Andreo, Luca; Rabezzana, Roberto; Operti, Lorenza; Diana, Eliano; Mahmoudi, Ghodrat; Frontera, Antonio |
Journal of publication |
Dalton Transactions |
Year of publication |
2022 |
a |
7.2797 ± 0.0013 Å |
b |
9.847 ± 0.004 Å |
c |
10.868 ± 0.003 Å |
α |
86.98 ± 0.03° |
β |
79.08 ± 0.02° |
γ |
83.75 ± 0.02° |
Cell volume |
760 ± 0.4 Å3 |
Cell temperature |
297 ± 2 K |
Ambient diffraction temperature |
297 ± 2 K |
Number of distinct elements |
5 |
Space group number |
2 |
Hermann-Mauguin space group symbol |
P -1 |
Hall space group symbol |
-P 1 |
Residual factor for all reflections |
0.2697 |
Residual factor for significantly intense reflections |
0.0972 |
Weighted residual factors for significantly intense reflections |
0.1507 |
Weighted residual factors for all reflections included in the refinement |
0.2131 |
Goodness-of-fit parameter for all reflections included in the refinement |
0.934 |
Diffraction radiation wavelength |
0.71073 Å |
Diffraction radiation type |
MoKα |
Yes |
No |
No |