Information card for entry 7709757
Formula |
C43 H27 Ag4 Au4 N15 |
Calculated formula |
C43 H27 Ag4 Au4 N15 |
Title of publication |
Metallophilic interactions in silver(I) dicyanoaurate complexes |
Authors of publication |
Priola, Emanuele; Giordana, Alessia; Gomila, Rosa Maria; Zangrando, Ennio; Andreo, Luca; Rabezzana, Roberto; Operti, Lorenza; Diana, Eliano; Mahmoudi, Ghodrat; Frontera, Antonio |
Journal of publication |
Dalton Transactions |
Year of publication |
2022 |
a |
11.3724 ± 0.0008 Å |
b |
14.8294 ± 0.001 Å |
c |
16.3394 ± 0.0011 Å |
α |
116.322 ± 0.007° |
β |
95.174 ± 0.005° |
γ |
101.927 ± 0.006° |
Cell volume |
2364 ± 0.3 Å3 |
Cell temperature |
298 ± 2 K |
Ambient diffraction temperature |
298 ± 2 K |
Number of distinct elements |
5 |
Space group number |
2 |
Hermann-Mauguin space group symbol |
P -1 |
Hall space group symbol |
-P 1 |
Residual factor for all reflections |
0.1358 |
Residual factor for significantly intense reflections |
0.0644 |
Weighted residual factors for significantly intense reflections |
0.1041 |
Weighted residual factors for all reflections included in the refinement |
0.1271 |
Goodness-of-fit parameter for all reflections included in the refinement |
1.071 |
Diffraction radiation wavelength |
0.71073 Å |
Diffraction radiation type |
MoKα |
Yes |
No |
No |