Information card for entry 7709761
Chemical name | catena-[bis(μ-azido)(μ-pyrazine)cobalt (II)]~n~ |
Formula | C4 H4 Co N8 |
Calculated formula | C4 H4 Co N8 |
Title of publication | A rare example of a double metamagnetic transition leading to 2D and 3D long-range order in the two-dimensional pyrazine- and azido-bridged cobalt(II) compound [Co(pyz)(N3)2] |
Authors of publication | Setifi, Zouaoui; Setifi, Fatima; Benmansour Souilamas, Samia; Liu, Xiangyu; Mague, Joel T.; Gomez Garcia, Carlos J.; Konieczny, Piotr; Reedijk, Jan |
Journal of publication | Dalton Transactions |
Year of publication | 2022 |
a | 15.1297 ± 0.0007 Å |
b | 7.1034 ± 0.0003 Å |
c | 6.6093 ± 0.0002 Å |
α | 90° |
β | 90° |
γ | 90° |
Cell volume | 710.32 ± 0.05 Å3 |
Cell temperature | 150 ± 2 K |
Ambient diffraction temperature | 150 ± 2 K |
Number of distinct elements | 4 |
Space group number | 63 |
Hermann-Mauguin space group symbol | C m c m |
Hall space group symbol | -C 2c 2 |
Residual factor for all reflections | 0.0385 |
Residual factor for significantly intense reflections | 0.0353 |
Weighted residual factors for significantly intense reflections | 0.0898 |
Weighted residual factors for all reflections included in the refinement | 0.0923 |
Goodness-of-fit parameter for all reflections included in the refinement | 1.104 |
Diffraction radiation wavelength | 1.54178 Å |
Diffraction radiation type | CuKα |