Information card for entry 7709782
Formula | C30 H25 Cl Co F6 N5 P |
Calculated formula | C30 H25 Cl Co F6 N5 P |
SMILES | [Co]123(Cl)([N](c4ccccc4)(Cc4[n]2cccc4)Cc2[n]1cccc2)[n]1c2c4[n]3cccc4ccc2ccc1.[P](F)(F)(F)(F)(F)[F-] |
Title of publication | Mononuclear Co(II) polypyridyl complexes: synthesis, molecular structure, DNA binding/cleavage, radical scavenging, docking studies and anticancer activities |
Authors of publication | Karumban, Kalai Selvan; Muley, Arabinda; Raut, Rajnikant; Gupta, Parth; Giri, Bishnubasu; Kumbhakar, Sadananda; Misra, Ashish; Maji, Somnath |
Journal of publication | Dalton Transactions |
Year of publication | 2022 |
a | 18.4902 ± 0.0002 Å |
b | 14.7585 ± 0.0002 Å |
c | 21.6101 ± 0.0002 Å |
α | 90° |
β | 90° |
γ | 90° |
Cell volume | 5897.13 ± 0.12 Å3 |
Cell temperature | 273 K |
Ambient diffraction temperature | 273 K |
Number of distinct elements | 7 |
Space group number | 61 |
Hermann-Mauguin space group symbol | P b c a |
Hall space group symbol | -P 2ac 2ab |
Residual factor for all reflections | 0.0538 |
Residual factor for significantly intense reflections | 0.0364 |
Weighted residual factors for significantly intense reflections | 0.0816 |
Weighted residual factors for all reflections included in the refinement | 0.091 |
Goodness-of-fit parameter for all reflections included in the refinement | 1.029 |
Diffraction radiation probe | x-ray |
Diffraction radiation wavelength | 1.54184 Å |
Diffraction radiation type | CuKα |