Information card for entry 7709824
Formula |
C106 H118 B4 Cl6 Cu12 F6 N30 O6 S14 W4 |
Calculated formula |
C106 H118 B4 Cl6 Cu12 F6 N30 O6 S14 W4 |
Title of publication |
Construction of cluster-based supramolecular wire and rectangle |
Authors of publication |
Tan, Yi; Wang, Zhi-Kang; Lang, Fei-Fan; Yu, Hui-Min; Chen, Cao; Ni, Chun-Yan; Wang, Meng-Yi; Song, Ying-Lin; Lang, Jian-Ping |
Journal of publication |
Dalton Transactions |
Year of publication |
2022 |
a |
10.0436 ± 0.0007 Å |
b |
18.5322 ± 0.0014 Å |
c |
25.0944 ± 0.0018 Å |
α |
101.575 ± 0.002° |
β |
97.944 ± 0.002° |
γ |
97.164 ± 0.002° |
Cell volume |
4475.6 ± 0.6 Å3 |
Cell temperature |
119.98 K |
Ambient diffraction temperature |
119.98 K |
Number of distinct elements |
10 |
Space group number |
2 |
Hermann-Mauguin space group symbol |
P -1 |
Hall space group symbol |
-P 1 |
Residual factor for all reflections |
0.103 |
Residual factor for significantly intense reflections |
0.0677 |
Weighted residual factors for significantly intense reflections |
0.1538 |
Weighted residual factors for all reflections included in the refinement |
0.1694 |
Goodness-of-fit parameter for all reflections included in the refinement |
1.036 |
Diffraction radiation wavelength |
0.71073 Å |
Diffraction radiation type |
MoKα |
Yes |
No |
No |