Information card for entry 7709843
Formula
C58 H40 N2
Calculated formula
C58 H40 N2
Title of publication
[5]Helicene-Based Chiral Triarylboranes with Large Luminescence Dissymmetry Factor Over 10-2 Level: Synthesis and Design Strategy via Isomeric Tuning of Steric Substitutions
Authors of publication
Zhao, Fei; Zhao, Jingyi; Wang, Yu; Liu, Hou-Ting; Shang, Qinghai; Wang, Nan; Yin, Xiaodong; Zheng, Xiaoyan; Chen, Pangkuan
Journal of publication
Dalton Transactions
Year of publication
2022
a
19.7342 ± 0.001 Å
b
11.7167 ± 0.0006 Å
c
18.0696 ± 0.0008 Å
α
90°
β
104.275 ± 0.002°
γ
90°
Cell volume
4049 ± 0.3 Å3
Cell temperature
180 ± 2 K
Ambient diffraction temperature
180 ± 2 K
Number of distinct elements
3
Space group number
15
Hermann-Mauguin space group symbol
C 1 2/c 1
Hall space group symbol
-C 2yc
Residual factor for all reflections
0.054
Residual factor for significantly intense reflections
0.0379
Weighted residual factors for significantly intense reflections
0.0908
Weighted residual factors for all reflections included in the refinement
0.1009
Goodness-of-fit parameter for all reflections included in the refinement
1.035
Diffraction radiation wavelength
0.71073 Å
Diffraction radiation type
MoKα
Yes
No
No