Information card for entry 7709921
Formula | C60 H138 Dy K N16 O P4 |
Calculated formula | C60 H138 Dy K N16 O P4 |
Title of publication | Spectroscopic and Electrochemical Characterization of a Pr4+ Imidophosphorane Complex and the Redox Chemistry of Nd3+ and Dy3+ Complexes |
Authors of publication | Rice, Natalie T.; Popov, Ivan A.; Carlson, Rebbeca; Greer, Samuel M.; Boggiano, Andrew C.; Stein, Benjamin William; Bacsa, John; Batista, Enrique R.; Yang, Ping; La Pierre, Henry Storms |
Journal of publication | Dalton Transactions |
Year of publication | 2022 |
a | 22.4405 ± 0.001 Å |
b | 15.8568 ± 0.0007 Å |
c | 25.4452 ± 0.0016 Å |
α | 90° |
β | 114.536 ± 0.002° |
γ | 90° |
Cell volume | 8236.7 ± 0.7 Å3 |
Cell temperature | 130 ± 2 K |
Ambient diffraction temperature | 130 ± 2 K |
Number of distinct elements | 7 |
Space group number | 15 |
Hermann-Mauguin space group symbol | C 1 2/c 1 |
Hall space group symbol | -C 2yc |
Residual factor for all reflections | 0.0437 |
Residual factor for significantly intense reflections | 0.0401 |
Weighted residual factors for significantly intense reflections | 0.0998 |
Weighted residual factors for all reflections included in the refinement | 0.1015 |
Goodness-of-fit parameter for all reflections included in the refinement | 1.095 |
Diffraction radiation wavelength | 0.71073 Å |
Diffraction radiation type | MoKα |