Information card for entry 7709954
Formula | C36 H32 N4 P2 |
Calculated formula | C36 H32 N4 P2 |
Title of publication | 2,2’-Bipyridine derived doubly BN fused bisphosphine-chalcogenides, [C5H3N(BF2){NCH2P(E)Ph2}]2 (E = O, S, Se): Tuning of structural features and photophysical studies |
Authors of publication | Mondal, Dipanjan; Sardar, Gopa; Kabra, Dinesh; Balakrishna, Maravanji Shivaramaiah |
Journal of publication | Dalton Transactions |
Year of publication | 2022 |
a | 8.9408 ± 0.0005 Å |
b | 9.5762 ± 0.0005 Å |
c | 10.2682 ± 0.0006 Å |
α | 62.279 ± 0.005° |
β | 74.45 ± 0.005° |
γ | 81.103 ± 0.004° |
Cell volume | 749.3 ± 0.08 Å3 |
Cell temperature | 150 K |
Ambient diffraction temperature | 150 K |
Number of distinct elements | 4 |
Space group number | 2 |
Hermann-Mauguin space group symbol | P -1 |
Hall space group symbol | -P 1 |
Residual factor for all reflections | 0.0457 |
Residual factor for significantly intense reflections | 0.037 |
Weighted residual factors for significantly intense reflections | 0.0897 |
Weighted residual factors for all reflections included in the refinement | 0.095 |
Goodness-of-fit parameter for all reflections included in the refinement | 1.105 |
Diffraction radiation probe | x-ray |
Diffraction radiation wavelength | 0.71073 Å |
Diffraction radiation type | MoKα |