Information card for entry 7709978
Formula | C30 H24 N4 Ni O6 |
Calculated formula | C30 H24 N4 Ni O6 |
SMILES | [Ni]123(Oc4cccc5ccc(O)[n]2c45)(Oc2cccc4ccc(O)[n]3c24)[n]2ccc(OC)cc2c2[n]1ccc(OC)c2 |
Title of publication | A new class of nickel(II) oxyquinoline-bipyridine complexes as potent anticancer agents induces apoptosis and autophagy in A549/DDP tumor cells through mitophagy pathways |
Authors of publication | Wang, Zhen-Feng; Wei, Qiao-Chang; Li, Jin-Xian; Zhou, Zhen; Zhang, Shuhua |
Journal of publication | Dalton Transactions |
Year of publication | 2022 |
a | 18.9427 ± 0.001 Å |
b | 9.0321 ± 0.0006 Å |
c | 31.3833 ± 0.0015 Å |
α | 90° |
β | 90.266 ± 0.005° |
γ | 90° |
Cell volume | 5369.4 ± 0.5 Å3 |
Cell temperature | 298 ± 2 K |
Ambient diffraction temperature | 298 ± 2 K |
Number of distinct elements | 5 |
Space group number | 15 |
Hermann-Mauguin space group symbol | C 1 2/c 1 |
Hall space group symbol | -C 2yc |
Residual factor for all reflections | 0.0897 |
Residual factor for significantly intense reflections | 0.061 |
Weighted residual factors for significantly intense reflections | 0.1393 |
Weighted residual factors for all reflections included in the refinement | 0.1645 |
Goodness-of-fit parameter for all reflections included in the refinement | 1.001 |
Diffraction radiation wavelength | 0.71073 Å |
Diffraction radiation type | MoKα |