Information card for entry 7709982
Formula | C30 H24 N4 Ni O4 |
Calculated formula | C30 H24 N4 Ni O4 |
SMILES | [Ni]123(Oc4cccc5ccc(O)[n]2c45)(Oc2cccc4ccc(O)[n]3c24)[n]2c(c3[n]1cc(C)cc3)ccc(c2)C |
Title of publication | A new class of nickel(II) oxyquinoline-bipyridine complexes as potent anticancer agents induces apoptosis and autophagy in A549/DDP tumor cells through mitophagy pathways |
Authors of publication | Wang, Zhen-Feng; Wei, Qiao-Chang; Li, Jin-Xian; Zhou, Zhen; Zhang, Shuhua |
Journal of publication | Dalton Transactions |
Year of publication | 2022 |
a | 8.8229 ± 0.0005 Å |
b | 10.9962 ± 0.0007 Å |
c | 14.068 ± 0.0009 Å |
α | 94.63 ± 0.005° |
β | 104.322 ± 0.005° |
γ | 96.494 ± 0.005° |
Cell volume | 1305.55 ± 0.14 Å3 |
Cell temperature | 293 ± 2 K |
Ambient diffraction temperature | 293 ± 2 K |
Number of distinct elements | 5 |
Space group number | 2 |
Hermann-Mauguin space group symbol | P -1 |
Hall space group symbol | -P 1 |
Residual factor for all reflections | 0.0776 |
Residual factor for significantly intense reflections | 0.0547 |
Weighted residual factors for significantly intense reflections | 0.1135 |
Weighted residual factors for all reflections included in the refinement | 0.1339 |
Goodness-of-fit parameter for all reflections included in the refinement | 1.071 |
Diffraction radiation probe | x-ray |
Diffraction radiation wavelength | 0.71073 Å |
Diffraction radiation type | MoKα |