Information card for entry 7709985
Formula | C28 H16 Cl2 I2 N4 Ni O2 |
Calculated formula | C28 H16 Cl2 I2 N4 Ni O2 |
SMILES | Ic1c2O[Ni]34(Oc5c6[n]4cccc6c(Cl)cc5I)([n]4c(cccc4)c4[n]3cccc4)[n]3c2c(c(Cl)c1)ccc3 |
Title of publication | A new class of nickel(II) oxyquinoline-bipyridine complexes as potent anticancer agents induces apoptosis and autophagy in A549/DDP tumor cells through mitophagy pathways |
Authors of publication | Wang, Zhen-Feng; Wei, Qiao-Chang; Li, Jin-Xian; Zhou, Zhen; Zhang, Shuhua |
Journal of publication | Dalton Transactions |
Year of publication | 2022 |
a | 15.3688 ± 0.0004 Å |
b | 16.0251 ± 0.0003 Å |
c | 22.4547 ± 0.0006 Å |
α | 90° |
β | 90° |
γ | 90° |
Cell volume | 5530.3 ± 0.2 Å3 |
Cell temperature | 150 ± 2 K |
Ambient diffraction temperature | 150.15 K |
Number of distinct elements | 7 |
Space group number | 61 |
Hermann-Mauguin space group symbol | P b c a |
Hall space group symbol | -P 2ac 2ab |
Residual factor for all reflections | 0.0597 |
Residual factor for significantly intense reflections | 0.0519 |
Weighted residual factors for significantly intense reflections | 0.1388 |
Weighted residual factors for all reflections included in the refinement | 0.1458 |
Goodness-of-fit parameter for all reflections included in the refinement | 1.059 |
Diffraction radiation wavelength | 0.71073 Å |
Diffraction radiation type | MoKα |