Information card for entry 7709989
Formula | C34 H24 Cl4 N4 Ni O2 |
Calculated formula | C34 H24 Cl4 N4 Ni O2 |
SMILES | [Ni]123(Oc4c5[n]1c(C)ccc5c(Cl)cc4Cl)(Oc1c4[n]2c(ccc4c(Cl)cc1Cl)C)[n]1c2c4[n]3c(C)ccc4ccc2ccc1C |
Title of publication | A new class of nickel(II) oxyquinoline-bipyridine complexes as potent anticancer agents induces apoptosis and autophagy in A549/DDP tumor cells through mitophagy pathways |
Authors of publication | Wang, Zhen-Feng; Wei, Qiao-Chang; Li, Jin-Xian; Zhou, Zhen; Zhang, Shuhua |
Journal of publication | Dalton Transactions |
Year of publication | 2022 |
a | 10.6119 ± 0.0006 Å |
b | 10.6486 ± 0.0006 Å |
c | 15.4291 ± 0.0009 Å |
α | 89.319 ± 0.002° |
β | 73.567 ± 0.002° |
γ | 70.849 ± 0.002° |
Cell volume | 1573.43 ± 0.16 Å3 |
Cell temperature | 293 ± 2 K |
Ambient diffraction temperature | 293 ± 2 K |
Number of distinct elements | 6 |
Space group number | 2 |
Hermann-Mauguin space group symbol | P -1 |
Hall space group symbol | -P 1 |
Residual factor for all reflections | 0.0997 |
Residual factor for significantly intense reflections | 0.048 |
Weighted residual factors for significantly intense reflections | 0.1092 |
Weighted residual factors for all reflections included in the refinement | 0.1319 |
Goodness-of-fit parameter for all reflections included in the refinement | 1.029 |
Diffraction radiation wavelength | 0.71073 Å |
Diffraction radiation type | MoKα |