Information card for entry 7710017
Formula | C18 H16 Cd N2 O4 |
Calculated formula | C18 H16 Cd N2 O4 |
Title of publication | Highly regenerative, fast colorimetric response for organo-toxin and oxo-anions in an aqueous medium using a discrete luminescent Cd(ii) complex in a heterogeneous manner with theoretical revelation |
Authors of publication | Kanzariya, Dashrathbhai B.; Khan, Tuhin S.; Das, Sourav; Lama, Prem; Bandyopadhyay, Rajib; Pal, Tapan K. |
Journal of publication | Dalton Transactions |
Year of publication | 2022 |
a | 13.6553 ± 0.0014 Å |
b | 5.3152 ± 0.0006 Å |
c | 11.405 ± 0.0012 Å |
α | 90° |
β | 108.258 ± 0.003° |
γ | 90° |
Cell volume | 786.11 ± 0.15 Å3 |
Cell temperature | 298 ± 2 K |
Ambient diffraction temperature | 298 ± 2 K |
Number of distinct elements | 5 |
Space group number | 14 |
Hermann-Mauguin space group symbol | P 1 21/c 1 |
Hall space group symbol | -P 2ybc |
Residual factor for all reflections | 0.0367 |
Residual factor for significantly intense reflections | 0.0261 |
Weighted residual factors for significantly intense reflections | 0.054 |
Weighted residual factors for all reflections included in the refinement | 0.0601 |
Goodness-of-fit parameter for all reflections included in the refinement | 1.086 |
Diffraction radiation wavelength | 0.71073 Å |
Diffraction radiation type | MoKα |