Information card for entry 7710026
Formula | C9 H4 Br4 N O8 Tb |
Calculated formula | C9 H4 Br4 N O8 Tb |
Title of publication | Four series of lanthanide coordination polymers based on the tetrabromobenzene-1,4-dicarboxylate ligand: structural diversity and multifunctional properties |
Authors of publication | Jiajaroen, Suwadee; Dungkeaw, Winya; Kielar, Filip; Sukwattanasinitt, Mongkol; Sahasithiwat, Somboon; Zenno, Hikaru; Hayami, Shinya; Azam, Mohammad; Al-Resayes, Saud I; Chainok, Kittipong |
Journal of publication | Dalton Transactions |
Year of publication | 2022 |
a | 9.1698 ± 0.0003 Å |
b | 9.1909 ± 0.0003 Å |
c | 10.0385 ± 0.0002 Å |
α | 104.299 ± 0.001° |
β | 93.492 ± 0.001° |
γ | 99.649 ± 0.001° |
Cell volume | 803.58 ± 0.04 Å3 |
Cell temperature | 296 K |
Ambient diffraction temperature | 296 K |
Number of distinct elements | 6 |
Space group number | 2 |
Hermann-Mauguin space group symbol | P -1 |
Hall space group symbol | -P 1 |
Residual factor for all reflections | 0.0292 |
Residual factor for significantly intense reflections | 0.0246 |
Weighted residual factors for significantly intense reflections | 0.0472 |
Weighted residual factors for all reflections included in the refinement | 0.0487 |
Goodness-of-fit parameter for all reflections included in the refinement | 1.069 |
Diffraction radiation probe | x-ray |
Diffraction radiation wavelength | 0.71073 Å |
Diffraction radiation type | MoKα |
Diffraction radiation X-ray symbol | K-L~3~ |