Information card for entry 7710029
Formula | C15 H12 Br6 Ce O9 |
Calculated formula | C15 H12 Br6 Ce O9 |
Title of publication | Four series of lanthanide coordination polymers based on the tetrabromobenzene-1,4-dicarboxylate ligand: structural diversity and multifunctional properties |
Authors of publication | Jiajaroen, Suwadee; Dungkeaw, Winya; Kielar, Filip; Sukwattanasinitt, Mongkol; Sahasithiwat, Somboon; Zenno, Hikaru; Hayami, Shinya; Azam, Mohammad; Al-Resayes, Saud I; Chainok, Kittipong |
Journal of publication | Dalton Transactions |
Year of publication | 2022 |
a | 20.482 ± 0.005 Å |
b | 10.656 ± 0.003 Å |
c | 22.09 ± 0.006 Å |
α | 90° |
β | 94.658 ± 0.009° |
γ | 90° |
Cell volume | 4805 ± 2 Å3 |
Cell temperature | 296 K |
Ambient diffraction temperature | 296 K |
Number of distinct elements | 5 |
Space group number | 15 |
Hermann-Mauguin space group symbol | C 1 2/c 1 |
Hall space group symbol | -C 2yc |
Residual factor for all reflections | 0.0298 |
Residual factor for significantly intense reflections | 0.0221 |
Weighted residual factors for significantly intense reflections | 0.0435 |
Weighted residual factors for all reflections included in the refinement | 0.0454 |
Goodness-of-fit parameter for all reflections included in the refinement | 1.041 |
Diffraction radiation probe | x-ray |
Diffraction radiation wavelength | 0.71073 Å |
Diffraction radiation type | MoKα |