Information card for entry 7710037
Formula | C15 H12 Br6 Nd O9 |
Calculated formula | C15 H12 Br6 Nd O9 |
Title of publication | Four series of lanthanide coordination polymers based on the tetrabromobenzene-1,4-dicarboxylate ligand: structural diversity and multifunctional properties |
Authors of publication | Jiajaroen, Suwadee; Dungkeaw, Winya; Kielar, Filip; Sukwattanasinitt, Mongkol; Sahasithiwat, Somboon; Zenno, Hikaru; Hayami, Shinya; Azam, Mohammad; Al-Resayes, Saud I; Chainok, Kittipong |
Journal of publication | Dalton Transactions |
Year of publication | 2022 |
a | 20.39 ± 0.0004 Å |
b | 10.6244 ± 0.0002 Å |
c | 22.1112 ± 0.0005 Å |
α | 90° |
β | 94.893 ± 0.001° |
γ | 90° |
Cell volume | 4772.53 ± 0.17 Å3 |
Cell temperature | 296 K |
Ambient diffraction temperature | 296 K |
Number of distinct elements | 5 |
Space group number | 15 |
Hermann-Mauguin space group symbol | C 1 2/c 1 |
Hall space group symbol | -C 2yc |
Residual factor for all reflections | 0.0249 |
Residual factor for significantly intense reflections | 0.0211 |
Weighted residual factors for significantly intense reflections | 0.045 |
Weighted residual factors for all reflections included in the refinement | 0.046 |
Goodness-of-fit parameter for all reflections included in the refinement | 1.122 |
Diffraction radiation probe | x-ray |
Diffraction radiation wavelength | 0.71073 Å |
Diffraction radiation type | MoKα |
Diffraction radiation X-ray symbol | K-L~3~ |