Information card for entry 7710061
Formula | C24 H42 Br6 Cu6 N2 S8 |
Calculated formula | C24 H42 Br6 Cu6 N2 S8 |
Title of publication | 2,2’-Ethylenebis(1,3-dithiane) as polydentate m2-, m4- and m5-assembling ligand for the construction of sulphur-rich Cu(I), Hg(II) and heterometallic Cu(I)/Hg(II) coordination polymers featuring uncommon network architectures |
Authors of publication | Viau, Lydie; Knorr, Michael; Knauer, Lena; Brieger, Lukas; Strohman, Carsten |
Journal of publication | Dalton Transactions |
Year of publication | 2022 |
a | 7.8928 ± 0.0011 Å |
b | 9.8456 ± 0.0014 Å |
c | 26.928 ± 0.004 Å |
α | 87.555 ± 0.002° |
β | 84.017 ± 0.002° |
γ | 87.229 ± 0.002° |
Cell volume | 2077.2 ± 0.5 Å3 |
Cell temperature | 200 K |
Ambient diffraction temperature | 200 K |
Number of distinct elements | 6 |
Space group number | 2 |
Hermann-Mauguin space group symbol | P -1 |
Hall space group symbol | -P 1 |
Residual factor for all reflections | 0.0369 |
Residual factor for significantly intense reflections | 0.0276 |
Weighted residual factors for significantly intense reflections | 0.0683 |
Weighted residual factors for all reflections included in the refinement | 0.0715 |
Goodness-of-fit parameter for all reflections included in the refinement | 1 |
Diffraction radiation probe | x-ray |
Diffraction radiation wavelength | 0.71073 Å |
Diffraction radiation type | MoKα |