Information card for entry 7710067
Formula | C17 H30 Br2 Cu Hg I N S6 |
Calculated formula | C17 H30 Br1.997 Cu Hg I1.003 N S6 |
Title of publication | 2,2’-Ethylenebis(1,3-dithiane) as polydentate m2-, m4- and m5-assembling ligand for the construction of sulphur-rich Cu(I), Hg(II) and heterometallic Cu(I)/Hg(II) coordination polymers featuring uncommon network architectures |
Authors of publication | Viau, Lydie; Knorr, Michael; Knauer, Lena; Brieger, Lukas; Strohman, Carsten |
Journal of publication | Dalton Transactions |
Year of publication | 2022 |
a | 10.1654 ± 0.0012 Å |
b | 12.582 ± 0.002 Å |
c | 13.033 ± 0.002 Å |
α | 67.07 ± 0.007° |
β | 69.373 ± 0.005° |
γ | 76.469 ± 0.006° |
Cell volume | 1427.7 ± 0.4 Å3 |
Cell temperature | 100 K |
Ambient diffraction temperature | 100 K |
Number of distinct elements | 8 |
Space group number | 2 |
Hermann-Mauguin space group symbol | P -1 |
Hall space group symbol | -P 1 |
Residual factor for all reflections | 0.0316 |
Residual factor for significantly intense reflections | 0.0229 |
Weighted residual factors for significantly intense reflections | 0.0354 |
Weighted residual factors for all reflections included in the refinement | 0.0377 |
Goodness-of-fit parameter for all reflections included in the refinement | 1.098 |
Diffraction radiation probe | x-ray |
Diffraction radiation wavelength | 0.71073 Å |
Diffraction radiation type | MoKα |