Information card for entry 7710071
Formula | C36.5 H31 B Cl F4 N3 O P Re |
Calculated formula | C36.5 H31 B Cl F4 N3 O P Re |
Title of publication | Syntheses, Rearrangements, and Structural Analyses of Unsaturated Nitrogen Donor Ligands Derived from Diphenyldiazomethane and the Chiral Rhenium Lewis Acid [(η5-C5H5)Re(NO)(PPh3)]+ |
Authors of publication | Estrada, Alexander Louis; Wititsuwannakul, Taveechai; Kromm, Klemenz; Hampel, Frank; Hall, Michael B.; Gladysz, John |
Journal of publication | Dalton Transactions |
Year of publication | 2022 |
a | 13.62 ± 0.003 Å |
b | 12.11 ± 0.002 Å |
c | 21.411 ± 0.004 Å |
α | 90° |
β | 104.79 ± 0.03° |
γ | 90° |
Cell volume | 3414.5 ± 1.2 Å3 |
Cell temperature | 173 ± 2 K |
Ambient diffraction temperature | 173 ± 2 K |
Number of distinct elements | 9 |
Space group number | 14 |
Hermann-Mauguin space group symbol | P 1 21/n 1 |
Hall space group symbol | -P 2yn |
Residual factor for all reflections | 0.0372 |
Residual factor for significantly intense reflections | 0.0275 |
Weighted residual factors for significantly intense reflections | 0.0588 |
Weighted residual factors for all reflections included in the refinement | 0.0622 |
Goodness-of-fit parameter for all reflections included in the refinement | 1.015 |
Diffraction radiation wavelength | 0.71073 Å |
Diffraction radiation type | Mo-Ka |