Information card for entry 7710089
Formula | C54 H42 B2 Br2 F8 N8 O5 Ru2 |
Calculated formula | C54 H40 B2 Br2 F8 N8 O5 Ru2 |
Title of publication | The effect of halogenation of salicylaldehyde on antiproliferative activities of {∆/Λ-[Ru(bpy)2(X,Y-sal)]BF4} complexes |
Authors of publication | Taghizadeh Shool, Maryam; Amiri Rudbari, Hadi; Gil-Antón, Tania Gil-Antón; Cuevas-Vicario, José Vicente; Garcia, Begona; Busto, Natalia; Moini, Nakisa; Blacque, Olivier |
Journal of publication | Dalton Transactions |
Year of publication | 2022 |
a | 10.508 ± 0.002 Å |
b | 12.625 ± 0.003 Å |
c | 13.078 ± 0.003 Å |
α | 108.15 ± 0.03° |
β | 107.82 ± 0.03° |
γ | 94.36 ± 0.03° |
Cell volume | 1541.1 ± 0.8 Å3 |
Cell temperature | 298 ± 2 K |
Ambient diffraction temperature | 298 ± 2 K |
Number of distinct elements | 8 |
Space group number | 2 |
Hermann-Mauguin space group symbol | P -1 |
Hall space group symbol | -P 1 |
Residual factor for all reflections | 0.0836 |
Residual factor for significantly intense reflections | 0.0555 |
Weighted residual factors for significantly intense reflections | 0.1611 |
Weighted residual factors for all reflections included in the refinement | 0.1795 |
Goodness-of-fit parameter for all reflections included in the refinement | 0.978 |
Diffraction radiation wavelength | 0.71073 Å |
Diffraction radiation type | MoKα |