Information card for entry 7710130
Formula |
C56.5 H65 Cl Co N3 |
Calculated formula |
C56.5 H65 Cl Co N3 |
Title of publication |
Modulation of the architectures and magnetic dynamics in pseudotetrahedral cobalt(II) complexes |
Authors of publication |
Zhou, Yuting; Li, Yuzhu; Xi, Jing; Qin, Yuanyuan; Cen, Peipei; Zhang, Yi-Quan; Guo, Yan; Ding, Yi; Liu, Xiangyu |
Journal of publication |
Dalton Transactions |
Year of publication |
2022 |
a |
9.4237 ± 0.0012 Å |
b |
12.6248 ± 0.0016 Å |
c |
22.087 ± 0.003 Å |
α |
102.736 ± 0.004° |
β |
99.487 ± 0.004° |
γ |
100.369 ± 0.004° |
Cell volume |
2463.3 ± 0.6 Å3 |
Cell temperature |
300 K |
Ambient diffraction temperature |
300 K |
Number of distinct elements |
5 |
Space group number |
2 |
Hermann-Mauguin space group symbol |
P -1 |
Hall space group symbol |
-P 1 |
Residual factor for all reflections |
0.057 |
Residual factor for significantly intense reflections |
0.0386 |
Weighted residual factors for significantly intense reflections |
0.0954 |
Weighted residual factors for all reflections included in the refinement |
0.106 |
Goodness-of-fit parameter for all reflections included in the refinement |
1.02 |
Diffraction radiation wavelength |
0.71073 Å |
Diffraction radiation type |
MoKα |
Yes |
Yes |
No |