Information card for entry 7710142
Formula | C30 H42 Ge N2 |
Calculated formula | C30 H42 Ge N2 |
SMILES | [Ge]1N(C2=C(N1c1c(cccc1C(C)C)C(C)C)CCCC2)c1c(cccc1C(C)C)C(C)C |
Title of publication | An α-diiminato germylene family: syntheses, structures, and reactivity towards C-C coupled digermylene and digermylene oxide |
Authors of publication | Liu, Jingjing; Shang, Jianxuan; Wei, Jing; Gao, Fangfang; Hou, Lei; Zeng, FanLong; Li, Anyang; Wang, Wenyuan |
Journal of publication | Dalton Transactions |
Year of publication | 2022 |
a | 31.977 ± 0.006 Å |
b | 11.392 ± 0.002 Å |
c | 18.293 ± 0.004 Å |
α | 90° |
β | 121.12 ± 0.007° |
γ | 90° |
Cell volume | 5705 ± 2 Å3 |
Cell temperature | 153 ± 2 K |
Ambient diffraction temperature | 153.15 K |
Number of distinct elements | 4 |
Space group number | 15 |
Hermann-Mauguin space group symbol | C 1 2/c 1 |
Hall space group symbol | -C 2yc |
Residual factor for all reflections | 0.0737 |
Residual factor for significantly intense reflections | 0.0649 |
Weighted residual factors for significantly intense reflections | 0.1528 |
Weighted residual factors for all reflections included in the refinement | 0.1599 |
Goodness-of-fit parameter for all reflections included in the refinement | 1.04 |
Diffraction radiation wavelength | 0.71073 Å |
Diffraction radiation type | MoKα |