Information card for entry 7710178
Formula | C35 H30 Cl N2 O P Pd |
Calculated formula | C35 H30 Cl N2 O P Pd |
SMILES | c1(ccccc1)[P]1(c2ccccc2)Cc2c3[Pd]1(Cl)[N]1=C(c3ccc2)N(C[C@@H]1c1ccccc1)c1ccc(cc1)OC |
Title of publication | Chiral (phosphine)-(imidazoline) PCN pincer palladium(II) complexes: synthesis and application in asymmetric hydrophosphination of 2-alkenoylpyridines with diphenylphosphine |
Authors of publication | Huang, Jun-Jian; Zhang, Xiao-Qi; Yang, Jing-Jing; Gong, Jun-Fang; Song, Mao-Ping |
Journal of publication | Dalton Transactions |
Year of publication | 2022 |
a | 9.20754 ± 0.00008 Å |
b | 14.47998 ± 0.00012 Å |
c | 22.6523 ± 0.0002 Å |
α | 90° |
β | 90° |
γ | 90° |
Cell volume | 3020.12 ± 0.05 Å3 |
Cell temperature | 293 ± 2 K |
Ambient diffraction temperature | 293 ± 2 K |
Number of distinct elements | 7 |
Space group number | 19 |
Hermann-Mauguin space group symbol | P 21 21 21 |
Hall space group symbol | P 2ac 2ab |
Residual factor for all reflections | 0.0302 |
Residual factor for significantly intense reflections | 0.0279 |
Weighted residual factors for significantly intense reflections | 0.0694 |
Weighted residual factors for all reflections included in the refinement | 0.0712 |
Goodness-of-fit parameter for all reflections included in the refinement | 1.031 |
Diffraction radiation probe | x-ray |
Diffraction radiation wavelength | 1.54184 Å |
Diffraction radiation type | CuKα |