Information card for entry 7710236
Formula | C10.95 H13.83 Hg N2 O3 S |
Calculated formula | C10.94 H13.82 Hg N2 O3 S |
Title of publication | Synthesis, structure and reactivity with phosphines of Hg(ii) ortho-cyano-aminothiophenolate complexes formed via C–S bond cleavage and dehydrogenation of 2-aminobenzothiazoles |
Authors of publication | Al-Jibori, Subhi A.; Irzoqi, Ahmed A.; Al-Janabi, Ahmed S. M.; Al-Nassiry, Amenah I. A.; Basak-Modi, Sucharita; Ghosh, Shishir; Wagner, Christoph; Hogarth, Graeme |
Journal of publication | Dalton Transactions |
Year of publication | 2022 |
a | 11.161 ± 0.004 Å |
b | 8.363 ± 0.003 Å |
c | 13.481 ± 0.005 Å |
α | 90° |
β | 92.388 ± 0.006° |
γ | 90° |
Cell volume | 1257.2 ± 0.8 Å3 |
Cell temperature | 150 ± 2 K |
Ambient diffraction temperature | 150.15 K |
Number of distinct elements | 6 |
Space group number | 14 |
Hermann-Mauguin space group symbol | P 1 21/c 1 |
Hall space group symbol | -P 2ybc |
Residual factor for all reflections | 0.0734 |
Residual factor for significantly intense reflections | 0.0429 |
Weighted residual factors for significantly intense reflections | 0.0922 |
Weighted residual factors for all reflections included in the refinement | 0.1123 |
Goodness-of-fit parameter for all reflections included in the refinement | 0.932 |
Diffraction radiation wavelength | 0.71073 Å |
Diffraction radiation type | MoKα |