Information card for entry 7710360
Formula | C66 H151 Li3 N10 Si6 U2 |
Calculated formula | C66 H151 Li3 N10 Si6 U2 |
Title of publication | Uranium–nitride chemistry: uranium–uranium electronic communication mediated by nitride bridges |
Authors of publication | King, David M.; Atkinson, Benjamin E.; Chatelain, Lucile; Gregson, Matthew; Seed, John A.; Wooles, Ashley J.; Kaltsoyannis, Nikolas; Liddle, Stephen T. |
Journal of publication | Dalton Transactions |
Year of publication | 2022 |
a | 16.9119 ± 0.0002 Å |
b | 16.9119 ± 0.0002 Å |
c | 28.5448 ± 0.0006 Å |
α | 90° |
β | 90° |
γ | 90° |
Cell volume | 8164.2 ± 0.2 Å3 |
Cell temperature | 120 ± 2 K |
Ambient diffraction temperature | 120 ± 2 K |
Number of distinct elements | 6 |
Space group number | 96 |
Hermann-Mauguin space group symbol | P 43 21 2 |
Hall space group symbol | P 4nw 2abw |
Residual factor for all reflections | 0.0271 |
Residual factor for significantly intense reflections | 0.024 |
Weighted residual factors for significantly intense reflections | 0.055 |
Weighted residual factors for all reflections included in the refinement | 0.0564 |
Goodness-of-fit parameter for all reflections included in the refinement | 1.018 |
Diffraction radiation probe | x-ray |
Diffraction radiation wavelength | 1.54184 Å |
Diffraction radiation type | CuKα |