Information card for entry 7710434
Formula | C12 H8 Cl2 N2 Pb |
Calculated formula | C12 H8 Cl2 N2 Pb |
Title of publication | Red room temperature phosphorescence of lead halide based coordination polymer showing efficient angle-dependent polarized emission and photoelectric performance |
Authors of publication | Tian, Xu-Ke; Zhang, Ji-Rui; Wen, Meng-Yao; Liu, Zi-Han; Guo, Jia-hui; Ma, Cheng-Yu; Zhang, Hao-Yi; Yang, Xiao-Gang; Ma, Lufang |
Journal of publication | Dalton Transactions |
Year of publication | 2022 |
a | 15.9914 ± 0.0008 Å |
b | 10.2501 ± 0.0004 Å |
c | 8.2441 ± 0.0004 Å |
α | 90° |
β | 106.39 ± 0.004° |
γ | 90° |
Cell volume | 1296.41 ± 0.11 Å3 |
Cell temperature | 293 ± 2 K |
Ambient diffraction temperature | 293 ± 2 K |
Number of distinct elements | 5 |
Space group number | 15 |
Hermann-Mauguin space group symbol | C 1 2/c 1 |
Hall space group symbol | -C 2yc |
Residual factor for all reflections | 0.041 |
Residual factor for significantly intense reflections | 0.0393 |
Weighted residual factors for significantly intense reflections | 0.0954 |
Weighted residual factors for all reflections included in the refinement | 0.099 |
Goodness-of-fit parameter for all reflections included in the refinement | 0.8932 |
Diffraction radiation wavelength | 0.71073 Å |
Diffraction radiation type | MoKα |