Information card for entry 7710468
Formula | C62 H62 B2 Co F14 N20 O2 |
Calculated formula | C62 H62 B2 Co F14 N20 O2 |
Title of publication | Fluorinated Click-Derived Tripodal Ligands Drive Spin Crossover in both Iron(II) and Cobalt(II) Complexes |
Authors of publication | Nößler, Maite; Hunger, David; Neuman, Nicolás Ignacio; Reimann, Marc; Reichert, Felix; Winkler, Mario; Klein, Johannes; Bens, Tobias; Suntrup, Lisa; Demeshko, Serhiy; Stubbe, Jessica; Kaupp, Martin; van Slageren, Joris; Sarkar, Biprajit |
Journal of publication | Dalton Transactions |
Year of publication | 2022 |
a | 7.7391 ± 0.0003 Å |
b | 20.7813 ± 0.0008 Å |
c | 20.1509 ± 0.0009 Å |
α | 90° |
β | 98.408 ± 0.003° |
γ | 90° |
Cell volume | 3206 ± 0.2 Å3 |
Cell temperature | 100 ± 2 K |
Ambient diffraction temperature | 100 K |
Number of distinct elements | 7 |
Space group number | 14 |
Hermann-Mauguin space group symbol | P 1 21/n 1 |
Hall space group symbol | -P 2yn |
Residual factor for all reflections | 0.1219 |
Residual factor for significantly intense reflections | 0.0928 |
Weighted residual factors for significantly intense reflections | 0.2113 |
Weighted residual factors for all reflections included in the refinement | 0.2274 |
Goodness-of-fit parameter for all reflections included in the refinement | 1.092 |
Diffraction radiation wavelength | 1.54178 Å |
Diffraction radiation type | CuKα |