Information card for entry 7710501
Formula |
C46 H67 N6 O16 Zn2 |
Calculated formula |
C38 H45 N4 O12 Zn2 |
Title of publication |
Construction of a chiral zinc–camphorate framework for enantioselective separation |
Authors of publication |
Zhu, Chengfeng; Wang, Hongzhao; Mu, Yongfei; Zhang, Ziwei; Cheng, Lanjun; Li, Tianfu; Fu, Yanming; Wu, Xiang; Li, Yougui |
Journal of publication |
Dalton Transactions |
Year of publication |
2022 |
a |
8.1892 ± 0.0013 Å |
b |
20.317 ± 0.003 Å |
c |
17.675 ± 0.003 Å |
α |
90° |
β |
98.647 ± 0.005° |
γ |
90° |
Cell volume |
2907.3 ± 0.8 Å3 |
Cell temperature |
100 K |
Ambient diffraction temperature |
100 K |
Number of distinct elements |
5 |
Space group number |
4 |
Hermann-Mauguin space group symbol |
P 1 21 1 |
Hall space group symbol |
P 2yb |
Residual factor for all reflections |
0.1134 |
Residual factor for significantly intense reflections |
0.0879 |
Weighted residual factors for significantly intense reflections |
0.248 |
Weighted residual factors for all reflections included in the refinement |
0.2705 |
Goodness-of-fit parameter for all reflections included in the refinement |
1.066 |
Diffraction radiation wavelength |
0.67042 Å |
Diffraction radiation type |
synchrotron |
Yes |
No |
No |