Information card for entry 7710546
Formula | C19 H28 Cl N2 Rh Si |
Calculated formula | C19 H28 Cl N2 Rh Si |
SMILES | [RhH]12(Cl)[Si](C(C)(C)C)(C(C)(C)C)Cc3[n]1c(ccc3)c1[n]2cccc1 |
Title of publication | Iridium and rhodium complexes bearing a silyl-bipyridine pincer ligand: synthesis, structures and catalytic activity for C–H borylation of arenes |
Authors of publication | Komuro, Takashi; Mochizuki, Daiki; Hashimoto, Hisako; Tobita, Hiromi |
Journal of publication | Dalton Transactions |
Year of publication | 2022 |
a | 15.0274 ± 0.0015 Å |
b | 14.7588 ± 0.0013 Å |
c | 9.128 ± 0.0011 Å |
α | 90° |
β | 95.52 ± 0.004° |
γ | 90° |
Cell volume | 2015.1 ± 0.4 Å3 |
Cell temperature | 150 ± 2 K |
Ambient diffraction temperature | 150 ± 2 K |
Number of distinct elements | 6 |
Space group number | 14 |
Hermann-Mauguin space group symbol | P 1 21/c 1 |
Hall space group symbol | -P 2ybc |
Residual factor for all reflections | 0.0376 |
Residual factor for significantly intense reflections | 0.032 |
Weighted residual factors for significantly intense reflections | 0.0625 |
Weighted residual factors for all reflections included in the refinement | 0.0641 |
Goodness-of-fit parameter for all reflections included in the refinement | 1.172 |
Diffraction radiation wavelength | 0.71073 Å |
Diffraction radiation type | MoKα |