Information card for entry 7710551
Formula | C36 H56 Br2 Co2 N4 P4 |
Calculated formula | C36 H56 Br2 Co2 N4 P4 |
Title of publication | Activator-free single-component Co(i)-catalysts for regio- and enantioselective heterodimerization and hydroacylation reactions of 1,3-dienes. New reduction procedures for synthesis of [L]Co(i)-complexes and comparison to in situ generated catalysts |
Authors of publication | Parsutkar, Mahesh M.; Moore, Curtis E.; RajanBabu, T. V. |
Journal of publication | Dalton Transactions |
Year of publication | 2022 |
a | 9.5542 ± 0.0002 Å |
b | 9.5542 ± 0.0002 Å |
c | 46.3014 ± 0.0012 Å |
α | 90° |
β | 90° |
γ | 90° |
Cell volume | 4226.52 ± 0.17 Å3 |
Cell temperature | 100 K |
Ambient diffraction temperature | 100 K |
Number of distinct elements | 6 |
Space group number | 92 |
Hermann-Mauguin space group symbol | P 41 21 2 |
Hall space group symbol | P 4abw 2nw |
Residual factor for all reflections | 0.0267 |
Residual factor for significantly intense reflections | 0.0236 |
Weighted residual factors for significantly intense reflections | 0.0557 |
Weighted residual factors for all reflections included in the refinement | 0.0563 |
Goodness-of-fit parameter for all reflections included in the refinement | 1.073 |
Diffraction radiation probe | x-ray |
Diffraction radiation wavelength | 0.71073 Å |
Diffraction radiation type | MoKα |