Information card for entry 7710598
Formula | C34 H55 B Br2 N2 Si |
Calculated formula | C34 H55 B Br2 N2 Si |
SMILES | Br[B]([Si]1([N](=C(N1C(C)(C)C)c1ccccc1)C(C)(C)C)C(C)(C)C)(Br)c1c(cc(cc1C(C)C)C(C)C)C(C)C |
Title of publication | High yield of a variety of silicon-boron radicals and their reactivity |
Authors of publication | Roesky, Herbert W.; Nazish, Mohd; Ding, Yi; Legendre, Christina M.; Kumar, Arun; Graw, Nico; Schwederski, Brigitte; Herbst-Irmer, Regine; P, Parvathy; Parameswaran, Pattiyil; Stalke, Dietmar; Kaim, Wolfgang |
Journal of publication | Dalton Transactions |
Year of publication | 2022 |
a | 16.079 ± 0.003 Å |
b | 12.497 ± 0.002 Å |
c | 17.886 ± 0.003 Å |
α | 90° |
β | 106.12 ± 0.02° |
γ | 90° |
Cell volume | 3452.7 ± 1.1 Å3 |
Cell temperature | 100 ± 2 K |
Ambient diffraction temperature | 100 ± 2 K |
Number of distinct elements | 6 |
Space group number | 14 |
Hermann-Mauguin space group symbol | P 1 21/n 1 |
Hall space group symbol | -P 2yn |
Residual factor for all reflections | 0.0608 |
Residual factor for significantly intense reflections | 0.0448 |
Weighted residual factors for significantly intense reflections | 0.1111 |
Weighted residual factors for all reflections included in the refinement | 0.1226 |
Goodness-of-fit parameter for all reflections included in the refinement | 1.133 |
Diffraction radiation wavelength | 0.71073 Å |
Diffraction radiation type | MoKα |