Information card for entry 7710637
Formula | C37.33 H33.33 Cl F3 O3 P2 Pd S |
Calculated formula | C37.3333 H33.3333 Cl F2.83333 O2.83333 P2 Pd S |
Title of publication | Cationic Palladium(II)-Indenyl complexes bearing phosphines as ancillary ligands: synthesis, study of indenyl amination and anticancer activity |
Authors of publication | Scattolin, Thomas; Visentin, Fabiano; Bortolamiol, Enrica; Caligiuri, Isabella; Rizzolio, Flavio; Cavallo, Luigi; Zhang, Ziyun; Demitri, Nicola; Fama, Francesco |
Journal of publication | Dalton Transactions |
Year of publication | 2022 |
a | 19.642 ± 0.004 Å |
b | 45.952 ± 0.009 Å |
c | 11.984 ± 0.002 Å |
α | 90° |
β | 90° |
γ | 90° |
Cell volume | 10817 ± 4 Å3 |
Cell temperature | 298 ± 2 K |
Ambient diffraction temperature | 298 ± 2 K |
Number of distinct elements | 8 |
Space group number | 62 |
Hermann-Mauguin space group symbol | P n m a |
Hall space group symbol | -P 2ac 2n |
Residual factor for all reflections | 0.0462 |
Residual factor for significantly intense reflections | 0.042 |
Weighted residual factors for significantly intense reflections | 0.1411 |
Weighted residual factors for all reflections included in the refinement | 0.1463 |
Goodness-of-fit parameter for all reflections included in the refinement | 1.031 |
Diffraction radiation wavelength | 0.62 Å |
Diffraction radiation type | Synchrotron |