Information card for entry 7710683
Chemical name | tBu-PBP-Pt-BH4 |
Formula | C24 H48 B2 N2 P2 Pt |
Calculated formula | C24 H48 B2 N2 P2 Pt |
SMILES | [Pt]123([P](C(C)(C)C)(C(C)(C)C)CN4c5c(N(B24)C[P]1(C(C)(C)C)C(C)(C)C)cccc5)[H][BH2][H]3 |
Title of publication | Coordination mode and stability of the tetrahydroborate ligand in group 10 metal pincer complexes |
Authors of publication | Chang, Jiarui; Ding, Man; Kang, Jiaxin; Zhang, Jie; Chen, Xuenian |
Journal of publication | Dalton Transactions |
Year of publication | 2022 |
a | 12.0479 ± 0.0001 Å |
b | 14.5349 ± 0.0002 Å |
c | 32.1411 ± 0.0003 Å |
α | 90° |
β | 90° |
γ | 90° |
Cell volume | 5628.39 ± 0.1 Å3 |
Cell temperature | 169.99 ± 0.1 K |
Ambient diffraction temperature | 169.99 ± 0.1 K |
Number of distinct elements | 6 |
Space group number | 61 |
Hermann-Mauguin space group symbol | P b c a |
Hall space group symbol | -P 2ac 2ab |
Residual factor for all reflections | 0.0364 |
Residual factor for significantly intense reflections | 0.0334 |
Weighted residual factors for significantly intense reflections | 0.0786 |
Weighted residual factors for all reflections included in the refinement | 0.0805 |
Goodness-of-fit parameter for all reflections included in the refinement | 1.098 |
Diffraction radiation probe | x-ray |
Diffraction radiation wavelength | 1.54184 Å |
Diffraction radiation type | CuKα |