Information card for entry 7710693
Formula |
C48 H104 N32 O272 Si136 |
Calculated formula |
C48 H104 N32 O272 Si136 |
Title of publication |
Acidic medium synthesis of zeolites – an avenue to control the structure-directing power of the organic template |
Authors of publication |
Fu, Guangying; Dib, Eddy; Lang, Qiaolin; Zhao, Haonuan; Wang, Songxia; Ding, Ruiqin; Yang, Xiaobo; Valtchev, Valentin |
Journal of publication |
Dalton Transactions |
Year of publication |
2022 |
a |
19.39366 ± 0.00019 Å |
b |
19.39366 Å |
c |
19.39366 Å |
α |
90° |
β |
90° |
γ |
90° |
Cell volume |
7294.23 ± 0.07 Å3 |
Cell temperature |
300 K |
Ambient diffraction temperature |
300 K |
Ambient diffracton pressure |
100 kPa |
Number of distinct elements |
5 |
Space group number |
1 |
Hermann-Mauguin space group symbol |
P 1 |
Hall space group symbol |
P 1 |
Weighted residual factors for significantly intense reflections |
0.06862 |
RFsqd |
0 |
Goodness-of-fit parameter for all reflections |
0.809 |
Method of determination |
powder diffraction |
Diffraction radiation probe |
x-ray |
Diffraction radiation wavelength |
1.54051 Å |
Diffraction radiation type |
Kα~1,2~ |
Yes |
No |
No |